Breach of Employment Contract with Specified Term
type: Class
alternative label: 违反有期限的雇佣合同
subclass of: RDR8hWYIaoudg2qZmCbzto6
definition: The Breach of Employment Contract with Specified Term refers to the violation of a legally binding agreement between an employer and an employee that includes a specific duration of employment.