Partnership Liability for Injury
type: Class
alternative label: 合伙责任侵权
subclass of: R8alUnZrt8GVEzHYhh1KTva
subclass of: R9JkfZIjkVSa5ud1tJ14w3i
definition: Partnership Liability for Injury refers to the legal responsibility of a partnership for injuries caused to a third party due to the actions or negligence of the partnership or its partners.