Food Safety and Inspection Service
type: Class
alternative label: 食品安全和检验局
subclass of: RA7830181D7dfE94ac567c1a
hidden label: FSIS
definition: The Food Safety and Inspection Service (FSIS), an agency of the United States Department of Agriculture (USDA), is the public health regulatory agency responsible for ensuring that United States' commercial supply of meat, poultry, and egg products is safe, wholesome, and correctly labeled and packaged.