Disclaimer of Responsibility Clause
type: Class
alternative label: 免责声明条款
subclass of: Ram7eqYuiBBxhcC5bDy59J
definition: A Disclaimer of Responsibility Clause is a statement in a legal document that absolves a party from any liability or obligation for the consequences of their actions or omissions.