Florida State Courts
type: Class
alternative label: FL
subclass of: R1F4dbe4CD17b3B2a7f15b97
hidden label: FL
definition: Florida State Courts are the judicial system of the state of Florida, responsible for interpreting and enforcing state laws and resolving legal disputes within the state.