Wholesale Trade Industry
type: Class
alternative label: 批发贸易行业
subclass of: RDIwFaFcH4KY0gwEY0QlMTp
hidden label: WHT
definition: The Wholesale Trade industry group comprises establishments engaged in wholesaling merchandise, generally without transformation, and rendering services incidental to the sale of merchandise. The merchandise described in this sector includes the outputs of agriculture, mining, manufacturing, and certain information industries, such as publishing. The wholesaling process is an intermediate step in the distribution of merchandise.