Pretrial Motions
type: Class
alternative label: 庭前动议
subclass of: R8zwKGkogGKIKWSVWb1ItRL
definition: Pretrial Motions are requests made by a party in a legal case before the trial begins, seeking a ruling or order from the court on a specific issue related to the case.