Government Access and Disclosure Law
type: Class
alternative label: 政府访问和披露法
subclass of: R7kUD6H5adQ83mCKuHjT5JD
hidden label: GVTA
definition: Law relating to the access and disclosure of information by a government.