Misappropriation of Likeness
type: Class
alternative label: 肖像权侵犯
subclass of: Rd7uelGFqCTWSgf9lWki5N
definition: The Misappropriation of Likeness is a legal claim that arises when someone uses another person's name, image, or likeness without their permission for commercial gain or other benefits.