Songhai languages
type: Class
alternative label: 松海语系
subclass of: RDOvAHsvY8TKJ1O1orXPM9o
definition: The Songhai languages are a group of languages that belong to the Language top-level class and are spoken in West Africa.