Motion to Quash Discovery
type: Class
alternative label: 撤销发现动议
subclass of: R9bP6BV3mGeNpZrOnXnoZoG
definition: A Motion to Quash Discovery is a legal request to prevent the opposing party from obtaining certain information or evidence through the discovery process.