Fish
type: Class
subclass of: R8sd4v04cEXnzbttN2gUEpV
subclass of: RDfwCFFw23Fb7WhqmrYLBqS
definition: Fish are aquatic vertebrate animals that are characterized by their gills, fins, and typically a streamlined body, allowing them to live and move efficiently in water. They inhabit both freshwater and ocean environments.