Prostitution
type: Class
alternative label: 卖淫
subclass of: R4tTlnh0xdCEoQbj8CkWoB
subclass of: RCqBiJAwLT5iG2nvk12tNKW
definition: The act of engaging in sexual activity in exchange for money or other forms of compensation, which is considered a criminal offense under certain circumstances.