Public Lewdness
type: Class
alternative label: 公共猥亵
subclass of: RCqBiJAwLT5iG2nvk12tNKW
definition: Public Lewdness is a criminal offense that involves engaging in sexual activity or indecent exposure in a public place, which is considered offensive to the public's decency and morals.