item_disc_cred_amount
type: Class
subclass of: R8ktJqdQifgzEaV2DJkdMZa
subclass of: R9VdnoybnEodiN0EUTedSOz
definition: "Sum of all FEE_ITEM_DISC_CRED.disc_cred_amounts for this fee item. Does not include MATTER_DISC_CRED.disc_cred_amounts. "