Sex and Gender Discrimination in Wage Payment
type: Class
alternative label: 性别和性别歧视在工资支付中的表现
subclass of: R8BHWSISpza9Q9QLVKBZf7U
definition: Sex and Gender Discrimination in Wage Payment refers to the unfair treatment of individuals based on their sex or gender identity in terms of compensation for work performed.