Motion to Limit Notice
type: Class
alternative label: 限制通知动议
subclass of: R9Ii4OzSADsjS0VegX12oQJ
definition: A Motion to Limit Notice is a type of legal request made in bankruptcy proceedings to restrict the scope or distribution of a notice related to the case.