Solicitation of Prostitution
type: Class
alternative label: 引诱卖淫
subclass of: R4tTlnh0xdCEoQbj8CkWoB
subclass of: RCqBiJAwLT5iG2nvk12tNKW
definition: The solicitation of prostitution is a criminal misdemeanor offense that involves the act of offering or agreeing to pay for sexual acts with another person in exchange for money or other goods/services.