New York City Court - Long Beach
type: Class
subclass of: RCz0OhGJQscjwPvw2jQBP63
definition: New York City Court - Long Beach is a specific court located in Long Beach, New York, which falls under the jurisdiction of the larger New York City Court system.