Legal Use Cases
type: Class
alternative label: Legal Products
subclass of: Thing
definition: Legal Use Cases refers to a set of various categories of tasks within the legal industry, which can be completed by humans, machines, or both. Examples include legal research, contract management, intellectual property management, compliance management, and other organizational' use cases for legal work.