Missouri Circuit Court - Polk County
type: Class
subclass of: RDECjssxw76vdlahxiUTb4L
definition: The Missouri Circuit Court - Polk County is a specific court within the Missouri Circuit Court system that has jurisdiction over legal matters within Polk County, Missouri.