Kansas District Court - Franklin County
type: Class
subclass of: R8ahGaNbVpIwATBsrRg3EZp
definition: Kansas District Court - Franklin County: A specific court within the Kansas District Court system that has jurisdiction over legal matters within Franklin County.