Ndonga
type: Class
alternative label: 恩敦加语
subclass of: RDOvAHsvY8TKJ1O1orXPM9o
definition: Ndonga is a structured system of communication consisting of grammar and vocabulary, and is a specific language within the context of legal matters.