Norse, Old
type: Class
alternative label: 古诺尔斯语
subclass of: RDOvAHsvY8TKJ1O1orXPM9o
definition: Old Norse is an ancient language used by the Vikings and their descendants in Scandinavia and Iceland, characterized by its complex grammar and rich vocabulary.