Insurance Policy Rescission
type: Class
alternative label: 保险单撤销
subclass of: R9q0hyYnNxQC475BKXOxjbm
definition: The act of canceling an insurance policy due to misrepresentation or fraud by the policyholder.