Money Lent
type: Class
alternative label: 借出的钱
subclass of: RZ1dOPJ6HH6lMJGSLNxfwV
definition: A Money Lent (Claim) is a legal demand for repayment of a sum of money that was loaned to another party, based on a contractual or quasi-contractual agreement.