JM40 Post Assessment Work (excluding hearings) (UK J-CODE)
type: Class
subclass of: RBrbUpWawQHlBkPTsHqk7Ge
definition: Includes post-hearing calculations and all other work required to finalise the amounts due for principal, interest and the costs of the assessment