Camaguey
type: Class
alternative label: CU+09
subclass of: R37D338D4A984EDA2cbFAc66
hidden label: CU+09
definition: The United States Postal Service Office of the Inspector General plays a key role in maintaining the integrity and accountability of America's postal service, its revenue and assets, and its employees.