Asset Sales Practice
type: Class
alternative label: 资产销售实践
subclass of: RCijZPAaPw0lgYwtl8qWG67
subclass of: RlOHXQDunuaC2onsYyruMi
definition: Asset Sales Practice refers to the legal practice area that deals with the sale of assets, such as property or businesses, typically in the context of bankruptcy or restructuring proceedings.