ERISA Advisory Council
type: Class
alternative label: ERISA咨询委员会
subclass of: RE48519BA23ec089be08A63d
hidden label: ERISAAC
definition: The duties of the ERISA Advisory Council are to advise the Secretary and submit recommendations regarding the Secretary's functions under ERISA.