Motion to Dismiss for Lack of Jurisdiction
type: Class
alternative label: 管辖权不足驳回动议
subclass of: R9Xkp4FqX83NG5ZI0CDfQ1k
subclass of: RbAyL0ru5m8CyqAShGVq0e
definition: A Motion to Dismiss for Lack of Jurisdiction is a formal request made to a court to dismiss a case due to the court lacking the authority to hear and decide the matter at hand.