New Mexico Magistrate Court - Eddy County
type: Class
subclass of: RDSK8CbOPdmMwMyMIlw8pdO
definition: A court located in Eddy County, New Mexico that has limited jurisdiction over certain types of cases.