Assignability Clause
type: Class
alternative label: 可转让条款
subclass of: RDe0RKU39BlhcyACJW30ZLc
definition: An Assignability Clause is a provision in a contract that allows one party to transfer their rights and obligations to another party without the consent of the other party.