Saint Andrew
type: Class
alternative label: DM+02
subclass of: R4D02bb5C1eff4B4f86ABbdd
hidden label: DM+02
definition: Saint Andrew refers to a specific location within the political subdivision of Dominica.