08_2 Social Security (PACER NoS)
type: Class
subclass of: RCSGywkPBv7f2ACrfTSiirV
definition: 08_2 Social Security (PACER NoS) refers to a specific category of cases related to Social Security within the PACER Nature of Suit (NoS) Codes.