Florida Circuit Court - Alachua County - 8th Circuit Court
type: Class
subclass of: R3Q1HDu5jO8nvhdbr2Uj0c
definition: Florida Circuit Court - Alachua County (8th Circuit Court) is a specific court within the Florida Circuit Court system that has jurisdiction over legal proceedings in Alachua County.