367 Health Care/Pharmaceutical Personal Injury Product Liability (PACER NoS)
type: Class
subclass of: R723CZDeI1c9CzFdyGi58Xd
definition: Action alleging personal injury or death caused by a defective medical or pharmaceutical product.