Armed Services
type: Class
alternative label: Armed Forces
alternative label: Defense Forces
alternative label: Military Forces
alternative label: Military Services
alternative label: National Military
subclass of: RBQGborh1CfXanGZipDL0Qo
definition: Armed Services, or a Military Body, refers to the organized, trained, and equipped forces maintained by a state for national defense, security, and military operations. These forces are typically divided into distinct branches, each specializing in different domains of warfare and national security.