Afrihili
type: Class
subclass of: RDOvAHsvY8TKJ1O1orXPM9o
definition: Afrihili is a structured system of communication, belonging to the Language top-level class, that consists of grammar and vocabulary and is used in legal matters.