Munda languages
type: Class
alternative label: 蒙达语系
subclass of: RDOvAHsvY8TKJ1O1orXPM9o
definition: Munda languages are a group of languages that belong to the Austroasiatic language family and are spoken in parts of India and Bangladesh.