Emotional State of Patient Doctrine
type: Class
alternative label: 患者情绪状态原则
subclass of: RCuus493FlHkCuRCdg8eDmC
definition: Defendant does not have to provide information about risks where the information will so seriously upset the patient that the patient will be unable to reasonably consider the risks of refusing the procedure.