Conflict of Laws Clause
type: Class
alternative label: 法律冲突条款
subclass of: RDe0RKU39BlhcyACJW30ZLc
definition: A Conflict of Laws Clause is a provision in a contract that determines which jurisdiction's laws will apply in the event of a legal dispute between the parties involved.