Motion for Exemption from Financial Management Course
type: Class
alternative label: 免除财务管理课程的申请
subclass of: R9Ii4OzSADsjS0VegX12oQJ
definition: A Motion for Exemption from Financial Management Course is a request made in a bankruptcy case to be excused from completing a financial management course as required by law.