Florida Circuit Court - Polk County - 10th Circuit Court
type: Class
subclass of: R3Q1HDu5jO8nvhdbr2Uj0c
definition: A Florida Circuit Court located in Polk County that operates within the 10th Circuit Court jurisdiction.