Ile-de-France
type: Class
alternative label: FR+J
subclass of: R68E7baC4A59d4E0897F8b28
hidden label: FR+J
definition: Ile-de-France is a region in France, located in the north-central part of the country.