DEPRECATED Debtor Claims Practice
type: Class
subclass of: R8H8cpx25KBk3kH55YwSdDv
definition: A debtor claims practice is a deprecated concept related to the legal process of making claims against a debtor.