Separated
type: Class
alternative label: 分离的
subclass of: RDgLz1KvQn0YL8W61rW55T4
definition: Separated (Marital Status) refers to the legal status of a married couple who are no longer living together but have not yet obtained a divorce.