Arbitrator
type: Class
alternative label: 仲裁人
subclass of: RDSYPGgBlFz5eWNtwoMA2c5
hidden label: ARBT
definition: An arbitrator is an independent person or body appointed to hear a dispute in arbitration.