JA00 Funding (UK J-CODE)
type: Class
subclass of: RCAZQP6AHCQX7HNZqzV7oIR
definition: All work relating to reviewing funding options, securing funding and reports to funders during the life of the case