Civil Arrest
type: Class
alternative label: 民事拘留
subclass of: R9pQxz2fUIrk1LjvVP8hikg
subclass of: RDBYmMtBs3jHkWCzKsvQP44
definition: The concept of Civil Arrest refers to the act of detaining a person by legal authority in order to enforce a civil judgment against them.